Image 01
profile-image

kangcy

chang kang
test
QtiPlot

Science 347 comments

Score 66.7%
Nov 07 2011
Hi

I got the following error compiling qtiplot. Anyone can explain how I can fix this?

ld: symbol(s) not found
collect2: ld returned 1 exit status
make: *** [qtiplot.app/Contents/MacOS/qtiplot] Error 1


Thanks in advance.. - Feb 22 2009
Hi

I got the following error during qtiplot compiling. Can anyone help me out?

../3rdparty/liborigin/OriginObj.h:37:29: error: boost/variant.hpp: No such file or directory
../3rdparty/liborigin/OriginObj.h:38:48: error: boost/date_time/posix_time/ptime.hpp: No such file or directory

where I can get this missing file?

thanks in advance.. - Feb 21 2009