Image 01
profile-image

johanneke

johanneke the beaver
klicker

Plasma 4 Extensions by dridk 17 comments

Hello, maybe a strange question, but how does one get the little icons to show as in the screeshot. All I got is the big icon of the wheel and nothing more.
I did make an entry to kmail in the options menu, so when I click the icon I get Kmail to show up. But how do I get more entry's?

Thanks in advance.
- Feb 19 2009
Drop2FTP

Plasma 4 Extensions by MatzeR 53 comments

I have a screenshot right here
(http://hellgate.nl/pics/mesg_drop2ftp.png)

Ans a seccond one for the config window
(http://hellgate.nl/pics/mesg_drop2ftp_config.png)

Hope it helps.

Thanks for looking into it... - Feb 15 2009
Drop2FTP

Plasma 4 Extensions by MatzeR 53 comments

Hey many thanks, it works...

But now something else strange is going on. After the Auth. messg. (where I successfully log in) I get a new window stating that the "file already exists"

It presents me with a dialog question if I want to overwrite the newer "folder" named "img" with whatever "file" I drop on the icon on my desktop.

If I say 'yes' drop2ftp shows a dialog that everything went ok, the DIR is still there, but there is nothing in the DIR.

If I say 'No' nothing happens (of course).

I used the exact ftp://ftp.bla.bla/img phrase.


I hope you have a clue of what it may be.
Thanks in advance,
Johanneke

- Feb 14 2009
Drop2FTP

Plasma 4 Extensions by MatzeR 53 comments

Hey many thanks, it works...

But now something else strange is going on. After the Auth. messg. (where I successfully log in) I get a new window stating that the "file already exists"

It presents me with a dialog question if I want to overwrite the newer "folder" named "img" with whatever "file" I drop on the icon on my desktop.

If I say 'yes' drop2ftp shows a dialog that everything went ok, the DIR is still there, but there is nothing in the DIR.

If I say 'No' nothing happens (of course).

I used the exact ftp://ftp.bla.bla/img phrase.


I hope you have a clue of what it may be.
Thanks in advance,
Johanneke

- Feb 14 2009
Drop2FTP

Plasma 4 Extensions by MatzeR 53 comments

Quote:Could you post the address where you want to send the file to?

In which directory is the file saved?

I have ftp.anname.com/img as address, so the DIR I want it to save in would be "img"

If I use this address in any other ftp program, it works.

Thanks in advance.
Johanneke - Feb 13 2009
Drop2FTP

Plasma 4 Extensions by MatzeR 53 comments

Hello,

Everytime I drop a file on the icon I get the following message;

"Could not start process unable to create io-slave: Klauncher said: unknown protocol."

If I use konqueror for ftp it works fine.

Any idea what could be the problem..??


Thanks in advance.

Johanneke. - Feb 12 2009
Drop2FTP

Plasma 4 Extensions by MatzeR 53 comments

Cmake went well, but 'sudo make install' gives me the following:

Generating ui_drop2ftpConfig.h
Generating drop2ftp.moc
Scanning dependencies of target plasma_applet_drop2ftp
[ 66%] Building CXX object CMakeFiles/plasma_applet_drop2ftp.dir/plasma_applet_drop2ftp_automoc.o
[100%] Building CXX object CMakeFiles/plasma_applet_drop2ftp.dir/drop2ftp.o
In file included from /home/trips/Desktop/test/drop2ftp-0.1/drop2ftp.cpp:19:
/home/trips/Desktop/test/drop2ftp-0.1/drop2ftp.h:27:39: error: plasma/widgets/iconwidget.h: Bestand of map bestaat niet
In file included from /home/trips/Desktop/test/drop2ftp-0.1/drop2ftp.cpp:19:
/home/trips/Desktop/test/drop2ftp-0.1/drop2ftp.h:63: fout: ISO C++ forbids declaration of ‘IconWidget’ with no type
/home/trips/Desktop/test/drop2ftp-0.1/drop2ftp.h:63: fout: invalid use of ‘::’
/home/trips/Desktop/test/drop2ftp-0.1/drop2ftp.h:63: fout: expected ‘;’ before ‘*’ token
/home/trips/Desktop/test/drop2ftp-0.1/drop2ftp.cpp: In constructor ‘Drop2FTP::Drop2FTP(QObject*, const QVariantList&)’:
/home/trips/Desktop/test/drop2ftp-0.1/drop2ftp.cpp:47: fout: class ‘Drop2FTP’ does not have any field named ‘m_icon’
/home/trips/Desktop/test/drop2ftp-0.1/drop2ftp.cpp: In destructor ‘virtual Drop2FTP::~Drop2FTP()’:
/home/trips/Desktop/test/drop2ftp-0.1/drop2ftp.cpp:57: fout: ‘m_icon’ was not declared in this scope
/home/trips/Desktop/test/drop2ftp-0.1/drop2ftp.cpp: In member function ‘virtual void Drop2FTP::init()’:
/home/trips/Desktop/test/drop2ftp-0.1/drop2ftp.cpp:66: fout: ‘m_icon’ was not declared in this scope
/home/trips/Desktop/test/drop2ftp-0.1/drop2ftp.cpp:66: fout: expected type-specifier
/home/trips/Desktop/test/drop2ftp-0.1/drop2ftp.cpp:66: fout: expected `;'
/home/trips/Desktop/test/drop2ftp-0.1/drop2ftp.cpp:71: fout: ‘ToolTipContent’ is not a member of ‘Plasma’
/home/trips/Desktop/test/drop2ftp-0.1/drop2ftp.cpp:71: fout: expected `;' before ‘toolTipData’
/home/trips/Desktop/test/drop2ftp-0.1/drop2ftp.cpp:73: fout: ‘class Plasma::ToolTipManager’ has no member named ‘setContent’
/home/trips/Desktop/test/drop2ftp-0.1/drop2ftp.cpp:73: fout: ‘toolTipData’ was not declared in this scope
/home/trips/Desktop/test/drop2ftp-0.1/drop2ftp.cpp: In member function ‘void Drop2FTP::slotResult(KJob*)’:
/home/trips/Desktop/test/drop2ftp-0.1/drop2ftp.cpp:113: fout: ‘m_icon’ was not declared in this scope
/home/trips/Desktop/test/drop2ftp-0.1/drop2ftp.cpp:117: fout: ‘m_icon’ was not declared in this scope
/home/trips/Desktop/test/drop2ftp-0.1/drop2ftp.cpp: In member function ‘void Drop2FTP::resetIcon()’:
/home/trips/Desktop/test/drop2ftp-0.1/drop2ftp.cpp:125: fout: ‘m_icon’ was not declared in this scope
/home/trips/Desktop/test/drop2ftp-0.1/drop2ftp.cpp: In member function ‘void Drop2FTP::sendToServer(KUrl::List)’:
/home/trips/Desktop/test/drop2ftp-0.1/drop2ftp.cpp:132: fout: ‘m_icon’ was not declared in this scope
make[2]: *** [CMakeFiles/plasma_applet_drop2ftp.dir/drop2ftp.o] Fout 1
make[1]: *** [CMakeFiles/plasma_applet_drop2ftp.dir/all] Fout 2
make: *** [all] Fout 2

Hope there is a solution, or else it will help you with ... well something. - Jan 12 2009
AmarokPidgin

Amarok 1.x Scripts by keegancsmith 150 comments

I installed via Amarok script manager, and the first time I could run and configure it.

First time I put it in "Nick" but my friends could not see it, so I changed to "Stauts", Selected the status and my friends could still not see anything, but I can still see my name as the last thing I played when it was configurated as "Nick"

Stopping, uninstalling, re-installing en running again changes nothing, still the same Nick with the last that I played in Amarok.
Changed my account (local alias) in Pidgin and all is well again.

Also I can't configure the script anymore, nothing happens when I push the button.

I uninstalled again and gonna fidle about a little with this.

(pidgin 2.4.1 - kubuntu Hardy - amarok 1.4.9.1) - Jun 03 2008
KShowmail

Email by kuddel-fl 64 comments

>> Which provider do you use?

I use orange.fr and exchange.active24.com for pop3...
The Orange one is working, I have problems with exchange.active24.com

Thanks for looking into this by the way... much appreciated. - May 13 2008
KShowmail

Email by kuddel-fl 64 comments

>>Try it with SSL (Port 995). You find it in the server setup dialog on the security tab. Please tell me the result.

If I try that, it says that it could not make a connection to the server.

And I understand completely why you would not implement the "Send mail" function.

Thanks for the help anyway, maybe it is my provider that is buggy. I have to do without, no problem. - May 13 2008
KShowmail

Email by kuddel-fl 64 comments

Hello,
I like to use this program because I am used to mailwasher and miss such thing in Linux.

But... If I use "apt-get install kshowmail" to install and start using the program I get this error after refreshing my accounts;
Authorization failed, An error occured during authentication: SASL(-7): invalid parameter supplied: Parameter error in client.c near line 440 authentication not supported.

So I thought of downloading the source from sourceforge.net (Version: 3.3) and compile it myself because maybe there was something broken or so... But after running ./configure I get this 2 errors

- "at the end of configure it says"
configure: creating ./config.status
wrong input (flag != 4) at admin/conf.change.pl line 117, <> line 1231.
config.status: creating Makefile
config.status: creating doc/Makefile
config.status: creating doc/cs/Makefile
config.status: creating doc/de/Makefile
config.status: creating doc/en/Makefile
config.status: creating doc/es/Makefile
config.status: creating doc/fr/Makefile
config.status: creating doc/hu/Makefile
config.status: creating doc/it/Makefile
config.status: creating doc/ru/Makefile
config.status: creating doc/sv/Makefile
config.status: creating kshowmail/Makefile
config.status: creating kshowmail/kcmconfigs/Makefile
config.status: creating pics/Makefile
config.status: creating po/Makefile
config.status: creating sounds/Makefile
config.status: creating config.h
config.status: config.h is unchanged
config.status: executing depfiles commands

Good - your configure finished. Start make now

So I ran "make" and this error comes up;
make
cd . && /bin/bash /home/trips/Desktop/kshowmail-3.3.0/kshowmail-3.3.0/admin/missing --run aclocal-1.9
/home/trips/Desktop/kshowmail-3.3.0/kshowmail-3.3.0/admin/missing: line 52: aclocal-1.9: command not found
WARNING: `aclocal-1.9' is missing on your system. You should only need it if
you modified `acinclude.m4' or `configure.in'. You might want
to install the `Automake' and `Perl' packages. Grab them from
any GNU archive site.
cd . && /bin/bash /home/trips/Desktop/kshowmail-3.3.0/kshowmail-3.3.0/admin/missing --run automake-1.9 --foreign
/home/trips/Desktop/kshowmail-3.3.0/kshowmail-3.3.0/admin/missing: line 52: automake-1.9: command not found
WARNING: `automake-1.9' is missing on your system. You should only need it if
you modified `Makefile.am', `acinclude.m4' or `configure.in'.
You might want to install the `Automake' and `Perl' packages.
Grab them from any GNU archive site.
cd . && perl admin/am_edit
cd . && perl admin/am_edit Makefile.in
cd . && rm -f configure
cd . && make -f admin/Makefile.common configure
make[1]: Entering directory `/home/trips/Desktop/kshowmail-3.3.0/kshowmail-3.3.0'
Can't open configure: No such file or directory.
make[1]: Leaving directory `/home/trips/Desktop/kshowmail-3.3.0/kshowmail-3.3.0'
/bin/bash ./config.status --recheck
running CONFIG_SHELL=/bin/bash /bin/bash ./configure --no-create --no-recursion
/bin/bash: ./configure: No such file or directory
make: *** [config.status] Error 127

It seems to me that somewhere on the line it looses the configure file (it is there if I check it after ./configure)

I am a noob on compiling things in Linux, so a little help is very appreciated.

<edit while typing this>
after a few retries suddenly the "make" command goes all the way to the end and I was able to do the "sudo make install"
But to no prevail, the first error still comes up after refreshing my accounts.

Just for the record, I have 3 accounts in kshowmail, 1 is working and the other 2, that are from the same domain, do not and produce the first error.
I tried to only put one of the two as the only account, but that does not work either... HELP!
</edit while typing this>

For the one account that works this is a great tool... the only thing I miss is the option to bounce back the mail, as if it came from postmaster (mail undeliverable).

Keep it up. - May 09 2008